Reaction Details
TargetSerine/threonine-protein kinase Sgk1
LigandBDBM50043021
Substrate/Competitorn/a
Meas. Tech.Enzymatic Activity Assay
pH7.4±n/a
IC50 1.50±n/a nM
Commentsextracted
Citation Nazare, MHalland, NSchmidt, FKleemann, HWeiss, TSaas, JStruebing, C N-(4-(azaindazol-6-yl)-phenyl)-sulfonamides and their use as pharmaceuticals US Patent US9718825 Publication Date 8/1/2017
 
Serine/threonine-protein kinase Sgk1
Name:Serine/threonine-protein kinase Sgk1
Type:Other Protein Type
Mol. Mass.:48954.40
Organism:Homo sapiens (Human)
Description:Recombinant human SGK-1 enzyme produced in a baculovirus system.
Residue:431
BDBM50043021
NameBDBM50043021
Synonyms:CHEMBL3355031 | US9718825, Example 140
TypeSmall organic molecule
Emp. Form.C19H16FN5O3S
Mol. Mass.413.425
SMILESCOc1nc(nc2[nH]ncc12)-c1ccc(NS(=O)(=O)c2cc(C)ccc2F)cc1