Reaction Details
TargetEpidermal growth factor receptor
LigandBDBM270575
Substrate/Competitorn/a
Meas. Tech.High Throughput EGFR Biochemical Assay
pH7±n/a
Temperature298.15±n/a K
EC50 102±n/a nM
Commentsextracted
Citation Balan, GChou, CKim, MKirschberg, TALink, JOPhillips, GSaito, RDSquires, NHTaylor, JGWatkins, WJWright, NE Cot modulators and methods of use thereof US Patent US10059695 Publication Date 8/28/2018
 
Epidermal growth factor receptor
Name:Epidermal growth factor receptor
Type:Receptor Kinase Domain
Mol. Mass.:134279.59
Organism:Homo sapiens (Human)
Description:P00533
Residue:1210
BDBM270575
NameBDBM270575
Synonyms:(S)-3-((1- cyclopropyl-1H- 1,2,3-triazol-4- yl)((4- (neopentylamino) quinazolin-6- yl)amino)methyl- d)benzonitrile US10577352, Compound I-7
TypeSmall organic molecule
Emp. Form.C26H28N8
Mol. Mass.452.5541
SMILESCC(C)(C)CNc1ncnc2ccc(NC(c3cn(nn3)C3CC3)c3cccc(c3)C#N)cc12