Reaction Details
TargetEpidermal growth factor receptor
LigandBDBM270579
Substrate/Competitorn/a
Meas. Tech.High Throughput EGFR Biochemical Assay
pH7±n/a
Temperature298.15±n/a K
IC50 46.0±n/a nM
Commentsextracted
Citation Balan, GChou, CKim, MKirschberg, TALink, JOPhillips, GSaito, RDSquires, NHTaylor, JGWatkins, WJWright, NE Cot modulators and methods of use thereof US Patent US10059695 Publication Date 8/28/2018
 
Epidermal growth factor receptor
Name:Epidermal growth factor receptor
Type:Receptor Kinase Domain
Mol. Mass.:134279.59
Organism:Homo sapiens (Human)
Description:P00533
Residue:1210
BDBM270579
NameBDBM270579
Synonyms:(R)-4-((8-chloro-6- (((S)-(1-cyclopropyl- 1H-1,2,3-triazol-4- yl)(4- fluorophenyl)methyl- d)amino)quinazolin- 4-yl)amino)-4- phenylbutanenitrile US10577352, Compound I-11
TypeSmall organic molecule
Emp. Form.C30H26ClFN8
Mol. Mass.553.032
SMILESFc1ccc(cc1)C(Nc1cc(Cl)c2ncnc(N[C@H](CCC#N)c3ccccc3)c2c1)c1cn(nn1)C1CC1