Reaction Details
TargetEpidermal growth factor receptor
LigandBDBM270600
Substrate/Competitorn/a
Meas. Tech.High Throughput EGFR Biochemical Assay
pH7±n/a
Temperature298.15±n/a K
IC50 49.0±n/a nM
Commentsextracted
Citation Balan, GChou, CKim, MKirschberg, TALink, JOPhillips, GSaito, RDSquires, NHTaylor, JGWatkins, WJWright, NE Cot modulators and methods of use thereof US Patent US10059695 Publication Date 8/28/2018
 
Epidermal growth factor receptor
Name:Epidermal growth factor receptor
Type:Receptor Kinase Domain
Mol. Mass.:134279.59
Organism:Homo sapiens (Human)
Description:P00533
Residue:1210
BDBM270600
NameBDBM270600
Synonyms:(S)-N4-(3-chloro-4- fluorophenyl)-N6- ((4-chlorophenyl)(1- (piperidin-4-yl)-1H- 1,2,3-triazol-4- yl)methyl) quinazoline- 4,6-diamine US10577352, Compound II-6
TypeSmall organic molecule
Emp. Form.C28H25Cl2FN8
Mol. Mass.563.456
SMILESFc1ccc(Nc2ncnc3ccc(N[C@H](c4cn(nn4)C4CCNCC4)c4ccc(Cl)cc4)cc23)cc1Cl