Reaction Details
TargetSerine/threonine-protein kinase pim-3
LigandBDBM81550
Substrate/Competitorn/a
Meas. Tech.Biochemical Assay
Kd 13±0.0 nM
Citation Miduturu, CVDeng, XKwiatkowski, NYang, WBrault, LFilippakopoulos, PChung, EYang, QSchwaller, JKnapp, SKing, RWLee, JDHerrgard, SZarrinkar, PGray, NS High-throughput kinase profiling: a more efficient approach toward the discovery of new kinase inhibitors. Chem Biol18:868-79 (2011) 
 
Serine/threonine-protein kinase pim-3
Name:Serine/threonine-protein kinase pim-3
Type:Protein
Mol. Mass.:35888.19
Organism:Homo sapiens (Human)
Description:Q86V86
Residue:326
BDBM81550
NameBDBM81550
Synonyms:Furan thiazolidinediones, A47
TypeSmall organic molecule
Emp. Form.C17H11N3O2S
Mol. Mass.321.353
SMILESN=C1NC(=O)\C(S1)=C/c1ccc(o1)-c1cncc2ccccc12