Reaction Details
TargetAurora kinase B
LigandBDBM81552
Substrate/Competitorn/a
Meas. Tech.Biochemical Assay
IC50 24±0.0 nM
Citation Miduturu, CVDeng, XKwiatkowski, NYang, WBrault, LFilippakopoulos, PChung, EYang, QSchwaller, JKnapp, SKing, RWLee, JDHerrgard, SZarrinkar, PGray, NS High-throughput kinase profiling: a more efficient approach toward the discovery of new kinase inhibitors. Chem Biol18:868-79 (2011) 
 
Aurora kinase B
Name:Aurora kinase B
Type:Protein
Mol. Mass.:39327.72
Organism:Homo sapiens (Human)
Description:Q96GD4
Residue:344
BDBM81552
NameBDBM81552
Synonyms:Benzo[e]pyrimido[5,4-b][1,4]diazepin-6(11H)-one, 1 | Scaffold, B54
TypeSmall organic molecule
Emp. Form.C24H26N6O2
Mol. Mass.430.5022
SMILESCN1c2ccccc2C(=O)N(C)c2cnc(Nc3ccc(cc3)N3CCC(O)CC3)nc12