Reaction Details
TargetGastrin/cholecystokinin type B receptor
LigandBDBM50002477
Substrate/Competitorn/a
Ki 25±n/a nM
CommentsPDSP_2195
Citation Lin, CWShiosaki, KMiller, TRWitte, DGBianchi, BRWolfram, CAKopecka, HCraig, RWagenaar, FNadzan, AM Characterization of two novel cholecystokinin tetrapeptide (30-33) analogues, A-71623 and A-70874, that exhibit high potency and selectivity for cholecystokinin-A receptors. Mol Pharmacol39:346-51 (1991) Gastrin/cholecystokinin type B receptor
Name:Gastrin/cholecystokinin type B receptor
Type:Enzyme Catalytic Domain
Mol. Mass.:48683.10
Organism:GUINEA PIG
Description:Cholecystokinin A CCKBR GUINEA PIG::H0VZC5
Residue:450
BDBM50002477
NameBDBM50002477
Synonyms:(S)-3-{(S)-2-[(S)-2-tert-Butoxycarbonylamino-3-(1H-indol-3-yl)-propionylamino]-4-methylsulfanyl-butyrylamino}-N-((S)-1-carbamoyl-2-phenyl-ethyl)-succinamic acid 3-{2-[2-tert-Butoxycarbonylamino-3-(1H-indol-3-yl)-propionylamino]-4-methylsulfanyl-butyrylamino}-N-(1-carbamoyl-2-phenyl-ethyl)-succinamic acid CHEMBL64605
TypeSmall organic molecule
Emp. Form.C34H44N6O8S
Mol. Mass.696.814
SMILESCSCC[C@H](NC(=O)[C@H](Cc1c[nH]c2ccccc12)NC(=O)OC(C)(C)C)C(=O)N[C@@H](CC(O)=O)C(=O)N[C@@H](Cc1ccccc1)C(N)=O