Reaction Details
TargetTyrosine-protein kinase ABL1
LigandBDBM50244527
Substrate/Competitorn/a
Meas. Tech.In Vitro Kinase Assay
IC50 2.4±0.0 nM
Citation Zhou, TCommodore, LHuang, WSWang, YSawyer, TKShakespeare, WCClackson, TZhu, XDalgarno, DC Structural analysis of DFG-in and DFG-out dual Src-Abl inhibitors sharing a common vinyl purine template. Chem Biol Drug Des75:18-28 (2010) 
 
Tyrosine-protein kinase ABL1
Name:Tyrosine-protein kinase ABL1
Type:Enzyme
Mol. Mass.:122897.30
Organism:Homo sapiens (Human)
Description:P00519
Residue:1130
BDBM50244527
NameBDBM50244527
Synonyms:9-(2-(1H-indazol-4-yl)vinyl)-N-(4-(dimethylphosphoryl)phenyl)-9H-purin-6-amine CHEMBL452563
TypeSmall organic molecule
Emp. Form.C22H20N7OP
Mol. Mass.429.4143
SMILESCP(C)(=O)c1ccc(Nc2ncnc3n(\C=C\c4cccc5[nH]ncc45)cnc23)cc1