Reaction Details
TargetTyrosine-protein kinase ABL1 [T315I]
LigandBDBM50244430
Substrate/Competitorn/a
Meas. Tech.In Vitro Kinase Assay
IC50 8900±0.0 nM
Citation Zhou, TCommodore, LHuang, WSWang, YSawyer, TKShakespeare, WCClackson, TZhu, XDalgarno, DC Structural analysis of DFG-in and DFG-out dual Src-Abl inhibitors sharing a common vinyl purine template. Chem Biol Drug Des75:18-28 (2010) 
 
Tyrosine-protein kinase ABL1 [T315I]
Name:Tyrosine-protein kinase ABL1 [T315I]
Type:n/a
Mol. Mass.:122909.35
Organism:Homo sapiens (Human)
Description:P00519 (T315I)
Residue:1130
BDBM50244430
NameBDBM50244430
Synonyms:9-(2,6-dimethylstyryl)-N-(4-(dimethylphosphoryl)phenyl)-9H-purin-6-amine CHEMBL488840
TypeSmall organic molecule
Emp. Form.C23H24N5OP
Mol. Mass.417.4433
SMILESCc1cccc(C)c1\C=C\n1cnc2c(Nc3ccc(cc3)P(C)(C)=O)ncnc12