Reaction Details
TargetKappa-type opioid receptor
LigandBDBM50000260
Substrate/Competitorn/a
Meas. Tech.ChEMBL_220946 (CHEMBL824621)
IC50 0.880000±n/a nM
Citation Scopes, DIHayes, NFBays, DEBelton, DBrain, JBrown, DSJudd, DBMcElroy, ABMeerholz, CANaylor, A New kappa-receptor agonists based upon a 2-[(alkylamino)methyl]piperidine nucleus. J Med Chem35:490-501 (1992) Kappa-type opioid receptor
Name:Kappa-type opioid receptor
Type:G Protein-Coupled Receptor (GPCR)
Mol. Mass.:42648.76
Organism:Homo sapiens (Human)
Description:P41145
Residue:380
BDBM50000260
NameBDBM50000260
Synonyms:2-(3,4-Dichloro-phenyl)-1-[2-(3-hydroxy-pyrrolidin-1-ylmethyl)-piperidin-1-yl]-ethanone | CHEMBL148219
TypeSmall organic molecule
Emp. Form.C18H24Cl2N2O2
Mol. Mass.371.301
SMILESOC1CCN(CC2CCCCN2C(=O)Cc2ccc(Cl)c(Cl)c2)C1