Reaction Details
TargetKappa-type opioid receptor
LigandBDBM50000285
Substrate/Competitorn/a
Meas. Tech.ChEBML_145682
IC50 15±n/a nM
Citation Scopes, DIHayes, NFBays, DEBelton, DBrain, JBrown, DSJudd, DBMcElroy, ABMeerholz, CANaylor, A New kappa-receptor agonists based upon a 2-[(alkylamino)methyl]piperidine nucleus. J Med Chem35:490-501 (1992) Kappa-type opioid receptor
Name:Kappa-type opioid receptor
Type:G Protein-Coupled Receptor (GPCR)
Mol. Mass.:42648.76
Organism:Homo sapiens (Human)
Description:P41145
Residue:380
BDBM50000285
NameBDBM50000285
Synonyms:1-{1-[2-(3,4-Dichloro-phenyl)-acetyl]-piperidin-2-ylmethyl}-1,2,5,6-tetrahydro-pyridine-3-carboxylic acid methyl ester | CHEMBL144483
TypeSmall organic molecule
Emp. Form.C21H26Cl2N2O3
Mol. Mass.425.349
SMILESCOC(=O)C1=CCCN(CC2CCCCN2C(=O)Cc2ccc(Cl)c(Cl)c2)C1