Reaction Details
TargetKappa-type opioid receptor
LigandBDBM50000284
Substrate/Competitorn/a
Meas. Tech.ChEMBL_220946 (CHEMBL824621)
IC50 1.7±n/a nM
Citation Scopes, DIHayes, NFBays, DEBelton, DBrain, JBrown, DSJudd, DBMcElroy, ABMeerholz, CANaylor, A New kappa-receptor agonists based upon a 2-[(alkylamino)methyl]piperidine nucleus. J Med Chem35:490-501 (1992) Kappa-type opioid receptor
Name:Kappa-type opioid receptor
Type:G Protein-Coupled Receptor (GPCR)
Mol. Mass.:42648.76
Organism:Homo sapiens (Human)
Description:P41145
Residue:380
BDBM50000284
NameBDBM50000284
Synonyms:2-(3,4-Dichloro-phenyl)-1-(2-methyl-6-pyrrolidin-1-ylmethyl-piperidin-1-yl)-ethanone | CHEMBL148083
TypeSmall organic molecule
Emp. Form.C19H26Cl2N2O
Mol. Mass.369.329
SMILESC[C@H]1CCC[C@@H](CN2CCCC2)N1C(=O)Cc1ccc(Cl)c(Cl)c1