Reaction Details
TargetPhosphatidylinositol 4,5-bisphosphate 3-kinase catalytic subunit delta isoform
LigandBDBM50239559
Substrate/Competitorn/a
Meas. Tech.ChEMBL_1666332 (CHEMBL4016128)
IC50 0.794328±n/a nM
Citation Perry, MWDBjörhall, KBonn, BCarlsson, JChen, YEriksson, AFredlund, LHao, HHolden, NSKarabelas, KLindmark, HLiu, FPemberton, NPetersen, JRodrigo Blomqvist, SSmith, RWSvensson, TTerstiege, ITyrchan, CYang, WZhao, SÖster, L Design and Synthesis of Soluble and Cell-Permeable PI3K? Inhibitors for Long-Acting Inhaled Administration. J Med Chem60:5057-5071 (2017) 
 
Phosphatidylinositol 4,5-bisphosphate 3-kinase catalytic subunit delta isoform
Name:Phosphatidylinositol 4,5-bisphosphate 3-kinase catalytic subunit delta isoform
Type:Enzyme Subunit
Mol. Mass.:119489.41
Organism:Homo sapiens (Human)
Description:O00329
Residue:1044
BDBM50239559
NameBDBM50239559
Synonyms:CHEMBL4073594
TypeSmall organic molecule
Emp. Form.C21H18N6OS
Mol. Mass.402.472
SMILESC[C@H](Nc1ncnc(N)c1C#N)c1cc2scc(C)n2c(=O)c1-c1ccccc1