Reaction Details
TargetPhosphatidylinositol 4,5-bisphosphate 3-kinase catalytic subunit delta isoform
LigandBDBM50239555
Substrate/Competitorn/a
Meas. Tech.ChEMBL_1666332 (CHEMBL4016128)
IC50 1.3±n/a nM
Citation Perry, MWDBjörhall, KBonn, BCarlsson, JChen, YEriksson, AFredlund, LHao, HHolden, NSKarabelas, KLindmark, HLiu, FPemberton, NPetersen, JRodrigo Blomqvist, SSmith, RWSvensson, TTerstiege, ITyrchan, CYang, WZhao, SÖster, L Design and Synthesis of Soluble and Cell-Permeable PI3K? Inhibitors for Long-Acting Inhaled Administration. J Med Chem60:5057-5071 (2017) 
 
Phosphatidylinositol 4,5-bisphosphate 3-kinase catalytic subunit delta isoform
Name:Phosphatidylinositol 4,5-bisphosphate 3-kinase catalytic subunit delta isoform
Type:Enzyme Subunit
Mol. Mass.:119489.41
Organism:Homo sapiens (Human)
Description:O00329
Residue:1044
BDBM50239555
NameBDBM50239555
Synonyms:CHEMBL4094000
TypeSmall organic molecule
Emp. Form.C32H40N8OS
Mol. Mass.584.778
SMILESCC(C)CN(C)C1CCN(Cc2cccc(c2)-c2c(cc3scc(C)n3c2=O)[C@H](C)Nc2ncnc(N)c2C#N)CC1