Reaction Details
TargetEukaryotic initiation factor 4A-I
LigandBDBM50239866
Substrate/Competitorn/a
Meas. Tech.ChEMBL_1667493 (CHEMBL4017289)
IC50>100000±n/a nM
Citation Iwatani-Yoshihara, MIto, MKlein, MGYamamoto, TYonemori, KTanaka, TMiwa, MMorishita, DEndo, STjhen, RQin, LNakanishi, AMaezaki, HKawamoto, T Discovery of Allosteric Inhibitors Targeting the Spliceosomal RNA Helicase Brr2. J Med Chem60:5759-5771 (2017) 
 
Eukaryotic initiation factor 4A-I
Name:Eukaryotic initiation factor 4A-I
Type:PROTEIN
Mol. Mass.:46146.87
Organism:Homo sapiens (Human)
Description:ChEMBL_864983
Residue:406
BDBM50239866
NameBDBM50239866
Synonyms:CHEMBL4065018
TypeSmall organic molecule
Emp. Form.C27H23N3O3
Mol. Mass.437.4898
SMILESO=C1Nc2cc(=O)n(Cc3ccccc3)cc2CN1c1cccc(OCc2ccccc2)c1