Reaction Details
TargetBromodomain-containing protein 4
LigandBDBM220434
Substrate/Competitorn/a
Meas. Tech.ChEMBL_1670395 (CHEMBL4020283)
EC50 88±n/a nM
Citation McDaniel, KFWang, LSoltwedel, TFidanze, SDHasvold, LALiu, DMantei, RAPratt, JKSheppard, GSBui, MHFaivre, EJHuang, XLi, LLin, XWang, RWarder, SEWilcox, DAlbert, DHMagoc, TJRajaraman, GPark, CHHutchins, CWShen, JJEdalji, RPSun, CCMartin, RGao, WWong, SFang, GElmore, SWShen, YKati, WM Discovery of N-(4-(2,4-Difluorophenoxy)-3-(6-methyl-7-oxo-6,7-dihydro-1H-pyrrolo[2,3-c]pyridin-4-yl)phenyl)ethanesulfonamide (ABBV-075/Mivebresib), a Potent and Orally Available Bromodomain and Extraterminal Domain (BET) Family Bromodomain Inhibitor. J Med Chem60:8369-8384 (2017) 
 
Bromodomain-containing protein 4
Name:Bromodomain-containing protein 4
Type:Protein
Mol. Mass.:152264.84
Organism:Homo sapiens (Human)
Description:O60885
Residue:1362
BDBM220434
NameBDBM220434
Synonyms:US9296741, 23
TypeSmall organic molecule
Emp. Form.C20H18N4O4S
Mol. Mass.410.446
SMILESCn1cc(-c2cc(NS(C)(=O)=O)cnc2Oc2ccccc2)c2cc[nH]c2c1=O