Reaction Details
TargetHistone deacetylase 3/Nuclear receptor corepressor 2 (HDAC3/NCoR2)
LigandBDBM50242138
Substrate/Competitorn/a
Meas. Tech.ChEMBL_1671351 (CHEMBL4021380)
IC50 29±n/a nM
Citation Kim, BRatnayake, RLee, HShi, GZeller, SLLi, CLuesch, HHong, J Synthesis and biological evaluation of largazole zinc-binding group analogs. Bioorg Med Chem25:3077-3086 (2017) 
 
Histone deacetylase 3/Nuclear receptor corepressor 2 (HDAC3/NCoR2)
Name:Histone deacetylase 3/Nuclear receptor corepressor 2 (HDAC3/NCoR2)
Type:n/a
Mol. Mass.:n/a
Description:ASSAY_ID of ChEMBL is 2146499
Components:This complex has 2 components.
Component 1
Name:Histone deacetylase 3
Synonyms:HD3 HDAC3_HUMAN Human HDAC3 SMAP45
Type:Enzyme
Mol. Mass.:48829.55
Organism:Homo sapiens (Human)
Description:O15379
Residue:428
Component 2
Name:Nuclear receptor corepressor 2
Synonyms:CTG repeat protein 26 Histone deacetylase 2/Nuclear receptor corepressor 2 NCOR2 Nuclear receptor corepressor 2 SMAP270 Silencing mediator of retinoic acid and thyroid hormone receptor TRAC | Thyroid-, retinoic-acid-receptor-associated corepressor
Type:Enzyme
Mol. Mass.:274839.59
Organism:Homo sapiens (Human)
Description:Q9Y618
Residue:2514
BDBM50242138
NameBDBM50242138
Synonyms:CHEMBL4099942
TypeSmall organic molecule
Emp. Form.C22H29N5O6S2
Mol. Mass.523.626
SMILESCC(C)[C@@H]1NC(=O)[C@]2(C)CSC(=N2)c2csc(CNC(=O)C[C@H](OC1=O)\C=C\CCC(=O)NO)n2