Reaction Details
TargetCoagulation factor VII
LigandBDBM50242367
Substrate/Competitorn/a
Meas. Tech.ChEMBL_1671569 (CHEMBL4021598)
Ki 9200±n/a nM
Citation Wurtz, NRParkhurst, BLDeLucca, IGlunz, PWJiang, WZhang, XCheney, DLBozarth, JMRendina, ARWei, AHarper, TLuettgen, JMWu, YWong, PCSeiffert, DAWexler, RRPriestley, ES Neutral macrocyclic factor VIIa inhibitors. Bioorg Med Chem Lett27:2650-2654 (2017) 
 
Coagulation factor VII
Name:Coagulation factor VII
Type:Enzyme
Mol. Mass.:51599.89
Organism:Homo sapiens (Human)
Description:n/a
Residue:466
BDBM50242367
NameBDBM50242367
Synonyms:CHEMBL4097785
TypeSmall organic molecule
Emp. Form.C27H28N4O4
Mol. Mass.472.5356
SMILESCCc1cc2ccc1CCOC(=O)Nc1cccc(CNC(=O)C2Nc2cccc(c2)C(N)=O)c1