Reaction Details
TargetVitamin K-dependent protein C
LigandBDBM50242359
Substrate/Competitorn/a
Meas. Tech.ChEMBL_1671579 (CHEMBL4021608)
Ki>10000±n/a nM
Citation Wurtz, NRParkhurst, BLDeLucca, IGlunz, PWJiang, WZhang, XCheney, DLBozarth, JMRendina, ARWei, AHarper, TLuettgen, JMWu, YWong, PCSeiffert, DAWexler, RRPriestley, ES Neutral macrocyclic factor VIIa inhibitors. Bioorg Med Chem Lett27:2650-2654 (2017) 
 
Vitamin K-dependent protein C
Name:Vitamin K-dependent protein C
Type:Enzyme
Mol. Mass.:52067.73
Organism:Homo sapiens (Human)
Description:n/a
Residue:461
BDBM50242359
NameBDBM50242359
Synonyms:CHEMBL4083729
TypeSmall organic molecule
Emp. Form.C33H34N4O6S
Mol. Mass.614.711
SMILESCN1Cc2cc(NC(=O)OCCc3c(C)cc(cc3C)[C@@H](Nc3ccc4cc[nH]c(=O)c4c3)C1=O)ccc2S(=O)(=O)C1CC1