Reaction Details
TargetGastrin/cholecystokinin type B receptor
LigandBDBM50406690
Substrate/Competitorn/a
Meas. Tech.ChEBML_47804
IC50 3.4±n/a nM
Citation Tilley, JWDanho, WShiuey, SJKulesha, ISwistok, JMakofske, RMichalewsky, JTriscari, JNelson, DWeatherford, S Analogs of Ac-CCK-7 incorporating dipeptide mimics in place of Met28-Gly29. J Med Chem35:3774-83 (1992) Gastrin/cholecystokinin type B receptor
Name:Gastrin/cholecystokinin type B receptor
Type:PROTEIN
Mol. Mass.:48807.54
Organism:Bos taurus
Description:ChEMBL_48437
Residue:454
BDBM50406690
NameBDBM50406690
Synonyms:CHEMBL2112635
TypeSmall organic molecule
Emp. Form.C47H58N8O13S2
Mol. Mass.1007.139
SMILESCSCC[C@H](NC(=O)[C@H](Cc1c[nH]c2ccccc12)NC(=O)C[C@@H]1CCCC[C@@H]1NC(=O)[C@H](Cc1ccc(cc1)S(O)(=O)=O)NC(O)=O)C(=O)N[C@@H](CC(O)=O)C(=O)N[C@@H](Cc1ccccc1)C(N)=O