Reaction Details
TargetTyrosine-protein kinase JAK1
LigandBDBM159753
Substrate/Competitorn/a
Meas. Tech.ChEMBL_1672940 (CHEMBL4022969)
IC50 28±n/a nM
Citation Vazquez, MLKaila, NStrohbach, JWTrzupek, JDBrown, MFFlanagan, MEMitton-Fry, MJJohnson, TATenBrink, REArnold, EPBasak, AHeasley, SEKwon, SLangille, JParikh, MDGriffin, SHCasavant, JMDuclos, BAFenwick, AEHarris, TMHan, SCaspers, NDowty, MEYang, XBanker, MEHegen, MSymanowicz, PTLi, LWang, LLin, THJussif, JClark, JDTelliez, JBRobinson, RPUnwalla, R Identification of N-{cis-3-[Methyl(7H-pyrrolo[2,3-d]pyrimidin-4-yl)amino]cyclobutyl}propane-1-sulfonamide (PF-04965842): A Selective JAK1 Clinical Candidate for the Treatment of Autoimmune Diseases. J Med Chem61:1130-1152 (2018) 
 
Tyrosine-protein kinase JAK1
Name:Tyrosine-protein kinase JAK1
Type:Protein
Mol. Mass.:133293.73
Organism:Homo sapiens (Human)
Description:P23458
Residue:1154
BDBM159753
NameBDBM159753
Synonyms:US10966980, Example 6 | US9035074, 6
TypeSmall organic molecule
Emp. Form.C15H21N5O3S
Mol. Mass.351.424
SMILESCN([C@@H]1C[C@@H](C1)NS(=O)(=O)CC1COC1)c1ncnc2[nH]ccc12