Reaction Details
TargetPhosphatidylinositol 4,5-bisphosphate 3-kinase catalytic subunit beta isoform
LigandBDBM50245517
Substrate/Competitorn/a
Meas. Tech.ChEMBL_1674766 (CHEMBL4024909)
IC50>15000±n/a nM
Citation Marcoux, DQin, LYRuan, ZShi, QRuan, QWeigelt, CQiu, HSchieven, GHynes, JBhide, RPoss, MTino, J Identification of highly potent and selective PI3K? inhibitors. Bioorg Med Chem Lett27:2849-2853 (2017) 
 
Phosphatidylinositol 4,5-bisphosphate 3-kinase catalytic subunit beta isoform
Name:Phosphatidylinositol 4,5-bisphosphate 3-kinase catalytic subunit beta isoform
Type:Enzyme Subunit
Mol. Mass.:122769.00
Organism:Homo sapiens (Human)
Description:P42338
Residue:1070
BDBM50245517
NameBDBM50245517
Synonyms:CHEMBL4086343
TypeSmall organic molecule
Emp. Form.C21H18F3N7O2
Mol. Mass.457.4085
SMILESNc1ncnn2c(cc(-c3ccnn3CC(F)(F)F)c12)-c1cccc(c1)N1CCOCC1=O