Reaction Details
TargetPhosphatidylinositol 4,5-bisphosphate 3-kinase catalytic subunit delta isoform
LigandBDBM358577
Substrate/Competitorn/a
Meas. Tech.ChEMBL_1674763 (CHEMBL4024906)
IC50 0.600000±n/a nM
Citation Marcoux, DQin, LYRuan, ZShi, QRuan, QWeigelt, CQiu, HSchieven, GHynes, JBhide, RPoss, MTino, J Identification of highly potent and selective PI3K? inhibitors. Bioorg Med Chem Lett27:2849-2853 (2017) 
 
Phosphatidylinositol 4,5-bisphosphate 3-kinase catalytic subunit delta isoform
Name:Phosphatidylinositol 4,5-bisphosphate 3-kinase catalytic subunit delta isoform
Type:Enzyme Subunit
Mol. Mass.:119489.41
Organism:Homo sapiens (Human)
Description:O00329
Residue:1044
BDBM358577
NameBDBM358577
Synonyms:(S)-4-(4-amino-5-(trifluoromethyl) pyrrolo[2,1-f][1,2,4]triazin-7-yl)-2- (2,2,5-trimethyl-3-oxomorpholino) benzonitrile | US10214537, Example 654
TypeSmall organic molecule
Emp. Form.C21H19F3N6O2
Mol. Mass.444.4098
SMILESC[C@H]1COC(C)(C)C(=O)N1c1cc(ccc1C#N)-c1cc(c2c(N)ncnn12)C(F)(F)F