Reaction Details
TargetPhosphatidylinositol 4,5-bisphosphate 3-kinase catalytic subunit gamma isoform
LigandBDBM50245519
Substrate/Competitorn/a
Meas. Tech.ChEMBL_1674764 (CHEMBL4024907)
IC50 99±n/a nM
Citation Marcoux, DQin, LYRuan, ZShi, QRuan, QWeigelt, CQiu, HSchieven, GHynes, JBhide, RPoss, MTino, J Identification of highly potent and selective PI3K? inhibitors. Bioorg Med Chem Lett27:2849-2853 (2017) 
 
Phosphatidylinositol 4,5-bisphosphate 3-kinase catalytic subunit gamma isoform
Name:Phosphatidylinositol 4,5-bisphosphate 3-kinase catalytic subunit gamma isoform
Type:Enzyme Subunit
Mol. Mass.:126470.30
Organism:Homo sapiens (Human)
Description:P48736
Residue:1102
BDBM50245519
NameBDBM50245519
Synonyms:CHEMBL4088828
TypeSmall organic molecule
Emp. Form.C23H22F3N7O2
Mol. Mass.485.4617
SMILESCC1(C)OCCN(C1=O)c1cccc(c1)-c1cc(-c2ccnn2CC(F)(F)F)c2c(N)ncnn12