Reaction Details
TargetPhosphatidylinositol 4,5-bisphosphate 3-kinase catalytic subunit alpha isoform
LigandBDBM50245578
Substrate/Competitorn/a
Meas. Tech.ChEMBL_1674765 (CHEMBL4024908)
IC50 1200±n/a nM
Citation Marcoux, DQin, LYRuan, ZShi, QRuan, QWeigelt, CQiu, HSchieven, GHynes, JBhide, RPoss, MTino, J Identification of highly potent and selective PI3K? inhibitors. Bioorg Med Chem Lett27:2849-2853 (2017) 
 
Phosphatidylinositol 4,5-bisphosphate 3-kinase catalytic subunit alpha isoform
Name:Phosphatidylinositol 4,5-bisphosphate 3-kinase catalytic subunit alpha isoform
Type:Enzyme Subunit
Mol. Mass.:124294.87
Organism:Homo sapiens (Human)
Description:P42336
Residue:1068
BDBM50245578
NameBDBM50245578
Synonyms:CHEMBL4061641
TypeSmall organic molecule
Emp. Form.C19H18F3N5O2
Mol. Mass.405.3737
SMILESCC1(C)OCCN(C1=O)c1cccc(c1)-c1cc(c2c(N)ncnn12)C(F)(F)F