Reaction Details
TargetPhosphatidylinositol 4,5-bisphosphate 3-kinase catalytic subunit alpha isoform
LigandBDBM50245584
Substrate/Competitorn/a
Meas. Tech.ChEMBL_1674765 (CHEMBL4024908)
IC50 630±n/a nM
Citation Marcoux, DQin, LYRuan, ZShi, QRuan, QWeigelt, CQiu, HSchieven, GHynes, JBhide, RPoss, MTino, J Identification of highly potent and selective PI3K? inhibitors. Bioorg Med Chem Lett27:2849-2853 (2017) 
 
Phosphatidylinositol 4,5-bisphosphate 3-kinase catalytic subunit alpha isoform
Name:Phosphatidylinositol 4,5-bisphosphate 3-kinase catalytic subunit alpha isoform
Type:Enzyme Subunit
Mol. Mass.:124294.87
Organism:Homo sapiens (Human)
Description:P42336
Residue:1068
BDBM50245584
NameBDBM50245584
Synonyms:CHEMBL4089756
TypeSmall organic molecule
Emp. Form.C24H24F3N7O3
Mol. Mass.515.4877
SMILESCOc1ccc(cc1N1CCOC(C)(C)C1=O)-c1cc(-c2ccnn2CC(F)(F)F)c2c(N)ncnn12