Reaction Details
TargetPhosphatidylinositol 4,5-bisphosphate 3-kinase catalytic subunit delta isoform
LigandBDBM50245561
Substrate/Competitorn/a
Meas. Tech.ChEMBL_1674767 (CHEMBL4024910)
IC50 56±n/a nM
Citation Marcoux, DQin, LYRuan, ZShi, QRuan, QWeigelt, CQiu, HSchieven, GHynes, JBhide, RPoss, MTino, J Identification of highly potent and selective PI3K? inhibitors. Bioorg Med Chem Lett27:2849-2853 (2017) 
 
Phosphatidylinositol 4,5-bisphosphate 3-kinase catalytic subunit delta isoform
Name:Phosphatidylinositol 4,5-bisphosphate 3-kinase catalytic subunit delta isoform
Type:Enzyme Subunit
Mol. Mass.:119489.41
Organism:Homo sapiens (Human)
Description:O00329
Residue:1044
BDBM50245561
NameBDBM50245561
Synonyms:CHEMBL4069213
TypeSmall organic molecule
Emp. Form.C21H21ClN6O2
Mol. Mass.424.883
SMILESC[C@@H]1OC(C)(C)C(=O)N([C@@H]1C)c1cc(ccc1C#N)-c1cc(Cl)c2c(N)ncnn12