Reaction Details
TargetPhosphatidylinositol 4,5-bisphosphate 3-kinase catalytic subunit gamma isoform
LigandBDBM50245581
Substrate/Competitorn/a
Meas. Tech.ChEMBL_1674764 (CHEMBL4024907)
IC50 20±n/a nM
Citation Marcoux, DQin, LYRuan, ZShi, QRuan, QWeigelt, CQiu, HSchieven, GHynes, JBhide, RPoss, MTino, J Identification of highly potent and selective PI3K? inhibitors. Bioorg Med Chem Lett27:2849-2853 (2017) 
 
Phosphatidylinositol 4,5-bisphosphate 3-kinase catalytic subunit gamma isoform
Name:Phosphatidylinositol 4,5-bisphosphate 3-kinase catalytic subunit gamma isoform
Type:Enzyme Subunit
Mol. Mass.:126470.30
Organism:Homo sapiens (Human)
Description:P48736
Residue:1102
BDBM50245581
NameBDBM50245581
Synonyms:CHEMBL4092654
TypeSmall organic molecule
Emp. Form.C19H17ClN6O2
Mol. Mass.396.83
SMILESCC1(C)OCCN(C1=O)c1cc(ccc1C#N)-c1cc(Cl)c2c(N)ncnn12