Reaction Details
TargetPhosphatidylinositol 4,5-bisphosphate 3-kinase catalytic subunit alpha isoform
LigandBDBM50245581
Substrate/Competitorn/a
Meas. Tech.ChEMBL_1674765 (CHEMBL4024908)
IC50 54±n/a nM
Citation Marcoux, DQin, LYRuan, ZShi, QRuan, QWeigelt, CQiu, HSchieven, GHynes, JBhide, RPoss, MTino, J Identification of highly potent and selective PI3K? inhibitors. Bioorg Med Chem Lett27:2849-2853 (2017) 
 
Phosphatidylinositol 4,5-bisphosphate 3-kinase catalytic subunit alpha isoform
Name:Phosphatidylinositol 4,5-bisphosphate 3-kinase catalytic subunit alpha isoform
Type:Enzyme Subunit
Mol. Mass.:124294.87
Organism:Homo sapiens (Human)
Description:P42336
Residue:1068
BDBM50245581
NameBDBM50245581
Synonyms:CHEMBL4092654
TypeSmall organic molecule
Emp. Form.C19H17ClN6O2
Mol. Mass.396.83
SMILESCC1(C)OCCN(C1=O)c1cc(ccc1C#N)-c1cc(Cl)c2c(N)ncnn12