Reaction Details
TargetPhosphatidylinositol 4,5-bisphosphate 3-kinase catalytic subunit delta isoform
LigandBDBM50245552
Substrate/Competitorn/a
Meas. Tech.ChEMBL_1674763 (CHEMBL4024906)
IC50 0.800000±n/a nM
Citation Marcoux, DQin, LYRuan, ZShi, QRuan, QWeigelt, CQiu, HSchieven, GHynes, JBhide, RPoss, MTino, J Identification of highly potent and selective PI3K? inhibitors. Bioorg Med Chem Lett27:2849-2853 (2017) 
 
Phosphatidylinositol 4,5-bisphosphate 3-kinase catalytic subunit delta isoform
Name:Phosphatidylinositol 4,5-bisphosphate 3-kinase catalytic subunit delta isoform
Type:Enzyme Subunit
Mol. Mass.:119489.41
Organism:Homo sapiens (Human)
Description:O00329
Residue:1044
BDBM50245552
NameBDBM50245552
Synonyms:CHEMBL4105636
TypeSmall organic molecule
Emp. Form.C20H19ClN6O2
Mol. Mass.410.857
SMILESC[C@H]1CN(C(=O)C(C)(C)O1)c1cc(ccc1C#N)-c1cc(Cl)c2c(N)ncnn12