Reaction Details
TargetTyrosine-protein kinase BTK
LigandBDBM50403056
Substrate/Competitorn/a
Meas. Tech.ChEMBL_1674788 (CHEMBL4024931)
IC50 9.5±n/a nM
Citation Liang, QChen, YYu, KChen, CZhang, SWang, AWang, WWu, HLiu, XWang, BWang, LHu, ZWang, WRen, TZhang, SLiu, QYun, CHLiu, J Discovery of N-(3-(5-((3-acrylamido-4-(morpholine-4-carbonyl)phenyl)amino)-1-methyl-6-oxo-1,6-dihydropyridin-3-yl)-2-methylphenyl)-4-(tert-butyl)benzamide (CHMFL-BTK-01) as a highly selective irreversible Bruton's tyrosine kinase (BTK) inhibitor. Eur J Med Chem131:107-125 (2017) 
 
Tyrosine-protein kinase BTK
Name:Tyrosine-protein kinase BTK
Type:Enzyme
Mol. Mass.:76289.95
Organism:Homo sapiens (Human)
Description:Q06187
Residue:659
BDBM50403056
NameBDBM50403056
Synonyms:CHEMBL2216827 US10828300, Compound I-342 US9987276, Compound I-342
TypeSmall organic molecule
Emp. Form.C26H22FN7O3
Mol. Mass.499.4964
SMILESCNC(=O)c1cc(Oc2ccc(Nc3ncc(F)c(Nc4cccc(NC(=O)C=C)c4)n3)cc2)ccn1