Reaction Details
TargetProtein arginine N-methyltransferase 6
LigandBDBM50243294
Substrate/Competitorn/a
Meas. Tech.ChEMBL_1676361 (CHEMBL4026504)
IC50 1.2±n/a nM
Citation Wang, CJiang, HJin, JXie, YChen, ZZhang, HLian, FLiu, YCZhang, CDing, HChen, SZhang, NZhang, YJiang, HChen, KYe, FYao, ZLuo, C Development of Potent Type I Protein Arginine Methyltransferase (PRMT) Inhibitors of Leukemia Cell Proliferation. J Med Chem60:8888-8905 (2017) 
 
Protein arginine N-methyltransferase 6
Name:Protein arginine N-methyltransferase 6
Type:Protein
Mol. Mass.:41928.48
Organism:Homo sapiens (Human)
Description:n/a
Residue:375
BDBM50243294
NameBDBM50243294
Synonyms:CHEMBL4094513
TypeSmall organic molecule
Emp. Form.C16H19ClN2S
Mol. Mass.306.853
SMILESCN(CCN)Cc1ccccc1Sc1ccccc1Cl