Reaction Details
TargetProtein arginine N-methyltransferase 1
LigandBDBM50245903
Substrate/Competitorn/a
Meas. Tech.ChEMBL_1676351 (CHEMBL4026494)
IC50 390±n/a nM
Citation Wang, CJiang, HJin, JXie, YChen, ZZhang, HLian, FLiu, YCZhang, CDing, HChen, SZhang, NZhang, YJiang, HChen, KYe, FYao, ZLuo, C Development of Potent Type I Protein Arginine Methyltransferase (PRMT) Inhibitors of Leukemia Cell Proliferation. J Med Chem60:8888-8905 (2017) 
 
Protein arginine N-methyltransferase 1
Name:Protein arginine N-methyltransferase 1
Type:PROTEIN
Mol. Mass.:40514.94
Organism:Rattus norvegicus
Description:ChEMBL_103589
Residue:353
BDBM50245903
NameBDBM50245903
Synonyms:CHEMBL4073964
TypeSmall organic molecule
Emp. Form.C18H23ClN2S
Mol. Mass.334.907
SMILESCN(C)CCN(C)Cc1ccccc1Sc1ccccc1Cl