Reaction Details
TargetHistone deacetylase 8
LigandBDBM50246846
Substrate/Competitorn/a
Meas. Tech.ChEMBL_1677037 (CHEMBL4027180)
IC50 69±n/a nM
Citation Heimburg, TKolbinger, FRZeyen, PGhazy, EHerp, DSchmidtkunz, KMelesina, JShaik, TBErdmann, FSchmidt, MRomier, CRobaa, DWitt, OOehme, IJung, MSippl, W Structure-Based Design and Biological Characterization of Selective Histone Deacetylase 8 (HDAC8) Inhibitors with Anti-Neuroblastoma Activity. J Med Chem60:10188-10204 (2017) 
 
Histone deacetylase 8
Name:Histone deacetylase 8
Type:Enzyme
Mol. Mass.:41749.60
Organism:Homo sapiens (Human)
Description:Q9BY41
Residue:377
BDBM50246846
NameBDBM50246846
Synonyms:CHEMBL4105068
TypeSmall organic molecule
Emp. Form.C15H16N2O3
Mol. Mass.272.2991
SMILESCOc1ccc(cc1NCc1ccccc1)C(=O)NO