Reaction Details
TargetCarbonic anhydrase 2
LigandBDBM50248706
Substrate/Competitorn/a
Meas. Tech.ChEMBL_1679286 (CHEMBL4029563)
IC50 65±n/a nM
Citation Hou, ZLin, BBao, YYan, HNZhang, MChang, XWZhang, XXWang, ZJWei, GFCheng, MSLiu, YGuo, C Dual-tail approach to discovery of novel carbonic anhydrase IX inhibitors by simultaneously matching the hydrophobic and hydrophilic halves of the active site. Eur J Med Chem132:1-10 (2017) 
 
Carbonic anhydrase 2
Name:Carbonic anhydrase 2
Type:Enzyme
Mol. Mass.:29250.71
Organism:Homo sapiens (Human)
Description:P00918
Residue:260
BDBM50248706
NameBDBM50248706
Synonyms:CHEMBL4063719
TypeSmall organic molecule
Emp. Form.C23H28N4O8S2
Mol. Mass.552.62
SMILESCOc1ccc(\C=C\C(=O)N[C@@H]2[C@@H](O)[C@H](O)[C@@H](CO)O[C@H]2NC(=S)Nc2ccc(cc2)S(N)(=O)=O)cc1