Reaction Details
TargetCarbonic anhydrase 2
LigandBDBM50146453
Substrate/Competitorn/a
Meas. Tech.ChEMBL_1679286 (CHEMBL4029563)
IC50 760000±n/a nM
Citation Hou, ZLin, BBao, YYan, HNZhang, MChang, XWZhang, XXWang, ZJWei, GFCheng, MSLiu, YGuo, C Dual-tail approach to discovery of novel carbonic anhydrase IX inhibitors by simultaneously matching the hydrophobic and hydrophilic halves of the active site. Eur J Med Chem132:1-10 (2017) 
 
Carbonic anhydrase 2
Name:Carbonic anhydrase 2
Type:Enzyme
Mol. Mass.:29250.71
Organism:Homo sapiens (Human)
Description:P00918
Residue:260
BDBM50146453
NameBDBM50146453
Synonyms:(E)-3-(4-Methoxy-phenyl)-acrylic acid 4-Methoxycinnamic acid para-methoxycinnamic acid
TypeSmall organic molecule
Emp. Form.C10H10O3
Mol. Mass.178.1846
SMILESCOc1ccc(\C=C\C(O)=O)cc1