Reaction Details
TargetCarbonic anhydrase 2
LigandBDBM50248711
Substrate/Competitorn/a
Meas. Tech.ChEMBL_1679286 (CHEMBL4029563)
IC50 14000±n/a nM
Citation Hou, ZLin, BBao, YYan, HNZhang, MChang, XWZhang, XXWang, ZJWei, GFCheng, MSLiu, YGuo, C Dual-tail approach to discovery of novel carbonic anhydrase IX inhibitors by simultaneously matching the hydrophobic and hydrophilic halves of the active site. Eur J Med Chem132:1-10 (2017) 
 
Carbonic anhydrase 2
Name:Carbonic anhydrase 2
Type:Enzyme
Mol. Mass.:29250.71
Organism:Homo sapiens (Human)
Description:P00918
Residue:260
BDBM50248711
NameBDBM50248711
Synonyms:CHEMBL4072315
TypeSmall organic molecule
Emp. Form.C17H23NO7
Mol. Mass.353.367
SMILESCO[C@@H]1O[C@H](CO)[C@@H](O)[C@H](O)[C@H]1NC(=O)\C=C\c1ccc(OC)cc1