Reaction Details
TargetCREB-binding protein
LigandBDBM50250896
Substrate/Competitorn/a
Meas. Tech.ChEBML_1682592
IC50 9.5±n/a nM
Citation Bronner, SMMurray, JRomero, FALai, KWTsui, VCyr, PBeresini, MHde Leon Boenig, GChen, ZChoo, EFClark, KRCrawford, TDJayaram, HKaufman, SLi, RLi, YLiao, JLiang, XLiu, WLy, JMaher, JWai, JWang, FZheng, AZhu, XMagnuson, S A Unique Approach to Design Potent and Selective Cyclic Adenosine Monophosphate Response Element Binding Protein, Binding Protein (CBP) Inhibitors. J Med Chem60:10151-10171 (2017) 
 
CREB-binding protein
Name:CREB-binding protein
Type:Transcription Coactivator
Mol. Mass.:265411.66
Organism:Homo sapiens (Human)
Description:Q92793
Residue:2442
BDBM50250896
NameBDBM50250896
Synonyms:CHEMBL4065346 US11168070, Example 52
TypeSmall organic molecule
Emp. Form.C24H23F2N5O
Mol. Mass.435.4691
SMILESCNC(=O)c1c[nH]c2ccc(cc12)N1CCCc2cc(-c3cnn(C)c3)c(cc12)C(F)F