Reaction Details
TargetAdenosylhomocysteinase
LigandBDBM50006215
Substrate/Competitorn/a
Meas. Tech.ChEBML_196726
Ki 49±n/a nM
Citation Wolfe, MSLee, YBartlett, WJBorcherding, DRBorchardt, RT 4'-modified analogues of aristeromycin and neplanocin A: synthesis and inhibitory activity toward S-adenosyl-L-homocysteine hydrolase. J Med Chem35:1782-91 (1992) Adenosylhomocysteinase
Name:Adenosylhomocysteinase
Type:PROTEIN
Mol. Mass.:47714.06
Organism:Homo sapiens (Human)
Description:ChEMBL_1507791
Residue:432
BDBM50006215
NameBDBM50006215
Synonyms:(1'R,2'S,3'R)-9-(2',3'-dihydroxycyclopent-4'-enyl)adenine 5-(6-Amino-purin-9-yl)-cyclopent-3-ene-1,2-diol | CHEMBL299961
TypeSmall organic molecule
Emp. Form.C10H11N5O2
Mol. Mass.233.2266
SMILESNc1ncnc2n(cnc12)[C@@H]1C=C[C@@H](O)[C@H]1O