Reaction Details
TargetHepatocyte growth factor receptor
LigandBDBM50251304
Substrate/Competitorn/a
Meas. Tech.ChEBML_1683677
IC50 5.6±n/a nM
Citation Tang, QWang, LDuan, YWang, WHuang, SZhi, JJia, SZhu, WWang, PLuo, RZheng, P Discovery of novel 7-azaindole derivatives bearing dihydropyridazine moiety as c-Met kinase inhibitors. Eur J Med Chem133:97-106 (2017) 
 
Hepatocyte growth factor receptor
Name:Hepatocyte growth factor receptor
Type:Protein
Mol. Mass.:155559.73
Organism:Homo sapiens (Human)
Description:P08581
Residue:1390
BDBM50251304
NameBDBM50251304
Synonyms:CHEMBL4087981
TypeSmall organic molecule
Emp. Form.C25H17F2N5O3
Mol. Mass.473.431
SMILESCc1cc(=O)n(nc1C(=O)Nc1ccc(Oc2ccnc3[nH]ccc23)c(F)c1)-c1cccc(F)c1