Reaction Details
TargetToll-like receptor 9
LigandBDBM50252307
Substrate/Competitorn/a
Meas. Tech.ChEMBL_1684603 (CHEMBL4035082)
IC50<50±n/a nM
Citation Roy, SMukherjee, APaul, BRahaman, ORoy, SMaithri, GRamya, BPal, SGanguly, DTalukdar, A Design and development of benzoxazole derivatives with toll-like receptor 9 antagonism. Eur J Med Chem134:334-347 (2017) 
 
Toll-like receptor 9
Name:Toll-like receptor 9
Type:Enzyme
Mol. Mass.:115889.91
Organism:Homo sapiens (Human)
Description:Q9NR96
Residue:1032
BDBM50252307
NameBDBM50252307
Synonyms:CHEMBL4082132
TypeSmall organic molecule
Emp. Form.C26H34N4O2
Mol. Mass.434.5738
SMILESCN1CCC(CC1)Nc1cccc(c1)-c1nc2ccc(OCCCN3CCCC3)cc2o1