Reaction Details
TargetToll-like receptor 9
LigandBDBM50252291
Substrate/Competitorn/a
Meas. Tech.ChEMBL_1684598 (CHEMBL4035077)
IC50 99±n/a nM
Citation Roy, SMukherjee, APaul, BRahaman, ORoy, SMaithri, GRamya, BPal, SGanguly, DTalukdar, A Design and development of benzoxazole derivatives with toll-like receptor 9 antagonism. Eur J Med Chem134:334-347 (2017) 
 
Toll-like receptor 9
Name:Toll-like receptor 9
Type:Enzyme
Mol. Mass.:115889.91
Organism:Homo sapiens (Human)
Description:Q9NR96
Residue:1032
BDBM50252291
NameBDBM50252291
Synonyms:CHEMBL4073879
TypeSmall organic molecule
Emp. Form.C25H29N3O2
Mol. Mass.403.5167
SMILESC(COc1ccc2nc(oc2c1)-c1cccc(c1)C1=CCNCC1)CN1CCCC1