Reaction Details
TargetToll-like receptor 9
LigandBDBM50252324
Substrate/Competitorn/a
Meas. Tech.ChEMBL_1684603 (CHEMBL4035082)
IC50 100±n/a nM
Citation Roy, SMukherjee, APaul, BRahaman, ORoy, SMaithri, GRamya, BPal, SGanguly, DTalukdar, A Design and development of benzoxazole derivatives with toll-like receptor 9 antagonism. Eur J Med Chem134:334-347 (2017) 
 
Toll-like receptor 9
Name:Toll-like receptor 9
Type:Enzyme
Mol. Mass.:115889.91
Organism:Homo sapiens (Human)
Description:Q9NR96
Residue:1032
BDBM50252324
NameBDBM50252324
Synonyms:CHEMBL4100138
TypeSmall organic molecule
Emp. Form.C32H38N4O2
Mol. Mass.510.6697
SMILESC(COc1ccc2nc(oc2c1)-c1cccc(NC2CCN(Cc3ccccc3)CC2)c1)CN1CCCC1