Reaction Details
TargetDNA topoisomerase 2-alpha
LigandBDBM36137
Substrate/Competitorn/a
Meas. Tech.ChEBML_1684924
IC50 26950±n/a nM
Citation Han, XZhong, YZhou, GQi, HLi, SDing, QLiu, ZSong, YQiao, X Synthesis and biological evaluation of N-(carbobenzyloxy)-l-phenylalanine and N-(carbobenzyloxy)-l-aspartic acid-?-benzyl ester derivatives as potent topoisomerase II? inhibitors. Bioorg Med Chem25:3116-3126 (2017) 
 
DNA topoisomerase 2-alpha
Name:DNA topoisomerase 2-alpha
Type:Protein
Mol. Mass.:174415.30
Organism:Homo sapiens (Human)
Description:P11388
Residue:1531
BDBM36137
NameBDBM36137
Synonyms:Cbz-L-Asp
TypeGuest
Emp. Form.C12H13NO6
Mol. Mass.267.2347
SMILESOC(=O)C[C@H](NC(=O)OCc1ccccc1)C(O)=O