Reaction Details
TargetSerine/threonine-protein kinase Chk1
LigandBDBM50255163
Substrate/Competitorn/a
Meas. Tech.ChEMBL_1686958 (CHEMBL4037437)
IC50 9±n/a nM
Citation Yang, BVasbinder, MMHird, AWSu, QWang, HYu, YToader, DLyne, PDRead, JABreed, JIoannidis, SDeng, CGrondine, MDeGrace, NWhitston, DBrassil, PJanetka, JW Adventures in Scaffold Morphing: Discovery of Fused Ring Heterocyclic Checkpoint Kinase 1 (CHK1) Inhibitors. J Med Chem61:1061-1073 (2018) 
 
Serine/threonine-protein kinase Chk1
Name:Serine/threonine-protein kinase Chk1
Type:Enzyme Catalytic Domain
Mol. Mass.:54443.02
Organism:Homo sapiens (Human)
Description:gi_166295192
Residue:476
BDBM50255163
NameBDBM50255163
Synonyms:CHEMBL4067770
TypeSmall organic molecule
Emp. Form.C20H21FN4O
Mol. Mass.352.4053
SMILESNC(=O)c1ccc(N[C@H]2CCCNC2)c2cc([nH]c12)-c1cccc(F)c1