Reaction Details
TargetSerine/threonine-protein kinase Chk1
LigandBDBM50243258
Substrate/Competitorn/a
Meas. Tech.ChEBML_1686958
IC50 7.0±n/a nM
Citation Yang, BVasbinder, MMHird, AWSu, QWang, HYu, YToader, DLyne, PDRead, JABreed, JIoannidis, SDeng, CGrondine, MDeGrace, NWhitston, DBrassil, PJanetka, JW Adventures in Scaffold Morphing: Discovery of Fused Ring Heterocyclic Checkpoint Kinase 1 (CHK1) Inhibitors. J Med Chem61:1061-1073 (2018) 
 
Serine/threonine-protein kinase Chk1
Name:Serine/threonine-protein kinase Chk1
Type:Enzyme Catalytic Domain
Mol. Mass.:54443.02
Organism:Homo sapiens (Human)
Description:gi_166295192
Residue:476
BDBM50243258
NameBDBM50243258
Synonyms:(S)-1-(5-phenyl-3-(piperidin-3-ylcarbamoyl)thiophen-2-yl)urea | CHEMBL487273
TypeSmall organic molecule
Emp. Form.C17H20N4O2S
Mol. Mass.344.431
SMILESNC(=O)Nc1sc(cc1C(=O)N[C@H]1CCCNC1)-c1ccccc1