Reaction Details
TargetSerine/threonine-protein kinase Chk1
LigandBDBM50254814
Substrate/Competitorn/a
Meas. Tech.ChEMBL_1686958 (CHEMBL4037437)
IC50 6±n/a nM
Citation Yang, BVasbinder, MMHird, AWSu, QWang, HYu, YToader, DLyne, PDRead, JABreed, JIoannidis, SDeng, CGrondine, MDeGrace, NWhitston, DBrassil, PJanetka, JW Adventures in Scaffold Morphing: Discovery of Fused Ring Heterocyclic Checkpoint Kinase 1 (CHK1) Inhibitors. J Med Chem61:1061-1073 (2018) 
 
Serine/threonine-protein kinase Chk1
Name:Serine/threonine-protein kinase Chk1
Type:Enzyme Catalytic Domain
Mol. Mass.:54443.02
Organism:Homo sapiens (Human)
Description:gi_166295192
Residue:476
BDBM50254814
NameBDBM50254814
Synonyms:CHEMBL4059912
TypeSmall organic molecule
Emp. Form.C20H22N4OS
Mol. Mass.366.48
SMILESC[C@H]1NCCC[C@@H]1Nc1ncc(C(N)=O)c2sc(cc12)-c1ccccc1