Reaction Details
TargetSerine/threonine-protein kinase Chk1
LigandBDBM50254805
Substrate/Competitorn/a
Meas. Tech.ChEBML_1686958
IC50 12±n/a nM
Citation Yang, BVasbinder, MMHird, AWSu, QWang, HYu, YToader, DLyne, PDRead, JABreed, JIoannidis, SDeng, CGrondine, MDeGrace, NWhitston, DBrassil, PJanetka, JW Adventures in Scaffold Morphing: Discovery of Fused Ring Heterocyclic Checkpoint Kinase 1 (CHK1) Inhibitors. J Med Chem61:1061-1073 (2018) 
 
Serine/threonine-protein kinase Chk1
Name:Serine/threonine-protein kinase Chk1
Type:Enzyme Catalytic Domain
Mol. Mass.:54443.02
Organism:Homo sapiens (Human)
Description:gi_166295192
Residue:476
BDBM50254805
NameBDBM50254805
Synonyms:CHEMBL4093952
TypeSmall organic molecule
Emp. Form.C21H24N4OS
Mol. Mass.380.506
SMILESC[C@@H]1CC[C@H](Nc2ncc(C(N)=O)c3sc(cc23)-c2ccccc2)[C@H](C)N1