Reaction Details
TargetSerine/threonine-protein kinase Chk1
LigandBDBM50332136
Substrate/Competitorn/a
Meas. Tech.ChEBML_1686958
IC50 7.0±n/a nM
Citation Yang, BVasbinder, MMHird, AWSu, QWang, HYu, YToader, DLyne, PDRead, JABreed, JIoannidis, SDeng, CGrondine, MDeGrace, NWhitston, DBrassil, PJanetka, JW Adventures in Scaffold Morphing: Discovery of Fused Ring Heterocyclic Checkpoint Kinase 1 (CHK1) Inhibitors. J Med Chem61:1061-1073 (2018) 
 
Serine/threonine-protein kinase Chk1
Name:Serine/threonine-protein kinase Chk1
Type:Enzyme Catalytic Domain
Mol. Mass.:54443.02
Organism:Homo sapiens (Human)
Description:gi_166295192
Residue:476
BDBM50332136
NameBDBM50332136
Synonyms:(S)-2-phenyl-4-(piperidin-3-ylamino)thieno[3,2-c]pyridine-7-carboxamide | CHEMBL1287920
TypeSmall organic molecule
Emp. Form.C19H20N4OS
Mol. Mass.352.453
SMILESNC(=O)c1cnc(N[C@H]2CCCNC2)c2cc(sc12)-c1ccccc1