Reaction Details
TargetSerine/threonine-protein kinase Chk1
LigandBDBM50255208
Substrate/Competitorn/a
Meas. Tech.ChEMBL_1686958 (CHEMBL4037437)
IC50 12±n/a nM
Citation Yang, BVasbinder, MMHird, AWSu, QWang, HYu, YToader, DLyne, PDRead, JABreed, JIoannidis, SDeng, CGrondine, MDeGrace, NWhitston, DBrassil, PJanetka, JW Adventures in Scaffold Morphing: Discovery of Fused Ring Heterocyclic Checkpoint Kinase 1 (CHK1) Inhibitors. J Med Chem61:1061-1073 (2018) 
 
Serine/threonine-protein kinase Chk1
Name:Serine/threonine-protein kinase Chk1
Type:Enzyme Catalytic Domain
Mol. Mass.:54443.02
Organism:Homo sapiens (Human)
Description:gi_166295192
Residue:476
BDBM50255208
NameBDBM50255208
Synonyms:CHEMBL4098878
TypeSmall organic molecule
Emp. Form.C19H19FN4OS
Mol. Mass.370.444
SMILESNC(=O)c1cnc(N[C@H]2CCCNC2)c2cc(sc12)-c1cccc(F)c1